November 2012 Archives by date
Starting: Thu Nov 1 10:37:33 CET 2012
Ending: Fri Nov 30 21:47:36 CET 2012
Messages: 547
- [GHC] #7380: Panic: mkNoTick: Breakpoint loading modules with -O2 via API
GHC
- [GHC] #5743: Configurably use system-provided libffi
GHC
- [GHC] #5743: Configurably use system-provided libffi
GHC
- [GHC] #7366: Strange data corruption with HEAD
GHC
- [GHC] #2451: New signal-handling API
GHC
- [GHC] #7369: Simplifier bug(?)
GHC
- [GHC] #7369: Simplifier bug(?)
GHC
- [GHC] #7381: Build failure with BuildFlavour = prof
GHC
- [GHC] #7381: Build failure with BuildFlavour = prof
GHC
- [GHC] #7382: Evaluating GHCi expressions is slow following the dynamic-by-default change
GHC
- [GHC] #7382: Evaluating GHCi expressions is slow following the dynamic-by-default change
GHC
- [GHC] #7383: implement proper type promotion in compilation of C calls
GHC
- [GHC] #7383: implement proper type promotion in compilation of C calls
GHC
- [GHC] #7382: Evaluating GHCi expressions is slow following the dynamic-by-default change
GHC
- [GHC] #7369: Simplifier bug(?)
GHC
- [GHC] #7384: Panic "ctEvTerm" when using functional dependencies and PolyKinds
GHC
- [GHC] #7385: Promotion of datatypes without -XDataKinds
GHC
- [GHC] #7385: Promotion of datatypes without -XDataKinds
GHC
- [GHC] #7386: Panic "tcTyVarDetails" in GHCi when :forcing a data family instance
GHC
- [GHC] #7374: rule not firing
GHC
- [GHC] #7387: threaded2 failures in HEAD
GHC
- [GHC] #7388: CAPI doesn't work with ghci
GHC
- [GHC] #7388: CAPI doesn't work with ghci
GHC
- [GHC] #7320: GHC crashes when building on 32-bit Linux in a Linode
GHC
- [GHC] #4012: Compilation results are not deterministic
GHC
- [GHC] #7389: can't link postgresql-libpq on windows
GHC
- [GHC] #7389: can't link postgresql-libpq on windows
GHC
- [GHC] #4012: Compilation results are not deterministic
GHC
- [GHC] #7381: Build failure with BuildFlavour = prof
GHC
- [GHC] #7381: Build failure with BuildFlavour = prof
GHC
- [GHC] #7390: Setup.hs: internal error: stg_ap_v_ret (MacOS)
GHC
- [GHC] #3072: considerations for management of shared libs
GHC
- [GHC] #7062: Spurious undefined reference to `openpty'
GHC
- [GHC] #7391: "The 'impossible' happened" trying to derive Binary for a data instance
GHC
- [GHC] #7392: "the impossible happened" when compiling Types.Substitutions
GHC
- [GHC] #7364: `foo !f = id . f` becomes non-strict with -O2
GHC
- [GHC] #7364: `foo !f = id . f` becomes non-strict with -O2
GHC
- [GHC] #7344: 64-bit and 32-bit binaries compiled with '-static' gets 'SIGKILL'ed (after many 'SIGVTALRM's and lots of memory consumption)
GHC
- [GHC] #7344: 64-bit and 32-bit binaries compiled with '-static' gets 'SIGKILL'ed (after many 'SIGVTALRM's and lots of memory consumption)
GHC
- [GHC] #7393: GHC cannot solve functional dependency
GHC
- [GHC] #7233: Int64 division buggy on a 32-bit installation
GHC
- [GHC] #7257: Regression: pinned memory fragmentation
GHC
- [GHC] #5991: regression: huge number of wakeups in xmonad
GHC
- [GHC] #7319: +RTS -xc sometimes results in segfault
GHC
- [GHC] #7394: SafeHaskell permits OPTIONS_GHC pragmas
GHC
- [GHC] #7393: GHC cannot solve functional dependency
GHC
- [GHC] #7392: "the impossible happened" when compiling Types.Substitutions
GHC
- [GHC] #7391: "The 'impossible' happened" trying to derive Binary for a data instance
GHC
- [GHC] #3072: considerations for management of shared libs
GHC
- [GHC] #3072: considerations for management of shared libs
GHC
- [GHC] #7364: `foo !f = id . f` becomes non-strict with -O2
GHC
- [GHC] #7361: Segmentation fault on 5f37e0c71ff4af8539c5aebc739b006b4f0c6ebf
GHC
- [GHC] #7361: Segmentation fault on 5f37e0c71ff4af8539c5aebc739b006b4f0c6ebf
GHC
- [GHC] #7387: threaded2 failures in HEAD
GHC
- [GHC] #7375: Building ghc fails because it is looking for an old version of libgmp
GHC
- [GHC] #7380: Panic: mkNoTick: Breakpoint loading modules with -O2 via API
GHC
- [GHC] #7382: Evaluating GHCi expressions is slow following the dynamic-by-default change
GHC
- [GHC] #7344: 64-bit and 32-bit binaries compiled with '-static' gets 'SIGKILL'ed (after many 'SIGVTALRM's and lots of memory consumption)
GHC
- [GHC] #7394: SafeHaskell permits OPTIONS_GHC pragmas
GHC
- [GHC] #7364: `foo !f = id . f` becomes non-strict with -O2
GHC
- [GHC] #7394: SafeHaskell permits OPTIONS_GHC pragmas
GHC
- [GHC] #7382: Evaluating GHCi expressions is slow following the dynamic-by-default change
GHC
- [GHC] #7395: DefaultSignatures conflict with default implementations
GHC
- [GHC] #3072: considerations for management of shared libs
GHC
- [GHC] #7361: Segmentation fault on 5f37e0c71ff4af8539c5aebc739b006b4f0c6ebf
GHC
- [GHC] #7382: Evaluating GHCi expressions is slow following the dynamic-by-default change
GHC
- [GHC] #7375: Building ghc fails because it is looking for an old version of libgmp
GHC
- [GHC] #7395: DefaultSignatures conflict with default implementations
GHC
- [GHC] #7364: `foo !f = id . f` becomes non-strict with -O2
GHC
- [GHC] #7395: DefaultSignatures conflict with default implementations
GHC
- [GHC] #7395: DefaultSignatures conflict with default implementations
GHC
- [GHC] #7395: DefaultSignatures conflict with default implementations
GHC
- [GHC] #7395: DefaultSignatures conflict with default implementations
GHC
- [GHC] #1409: Allow recursively dependent modules transparently (without .hs-boot or anything)
GHC
- [GHC] #1409: Allow recursively dependent modules transparently (without .hs-boot or anything)
GHC
- [GHC] #7364: `foo !f = id . f` becomes non-strict with -O2
GHC
- [GHC] #5252: UNPACK without optimisation leads to panic
GHC
- [GHC] #6010: GHC.Conc.labelThread function can't use Unicode character for thread label.
GHC
- [GHC] #6019: 'threadDelay maxBound' results in 'internal error: select failed'
GHC
- [GHC] #7191: hsc2hs can't treat absolute path correctly on Windows.
GHC
- [GHC] #7384: Panic "ctEvTerm" when using functional dependencies and PolyKinds
GHC
- [GHC] #7384: Panic "ctEvTerm" when using functional dependencies and PolyKinds
GHC
- [GHC] #7386: Panic "tcTyVarDetails" in GHCi when :forcing a data family instance
GHC
- [GHC] #7386: Panic "tcTyVarDetails" in GHCi when :forcing a data family instance
GHC
- [GHC] #7384: Panic "ctEvTerm" when using functional dependencies and PolyKinds
GHC
- [GHC] #7396: Improve "parse error on input `$'" when TemplateHaskell PRAGMA not declared
GHC
- [GHC] #7396: Improve "parse error on input `$'" when TemplateHaskell PRAGMA not declared
GHC
- [GHC] #4012: Compilation results are not deterministic
GHC
- [GHC] #7375: Building ghc fails because it is looking for an old version of libgmp
GHC
- [GHC] #7382: Evaluating GHCi expressions is slow following the dynamic-by-default change
GHC
- [GHC] #7397: -fwarn-irrefutable-patterns
GHC
- [GHC] #7397: -fwarn-irrefutable-patterns
GHC
- [GHC] #7397: -fwarn-irrefutable-patterns
GHC
- [GHC] #7397: -fwarn-irrefutable-patterns
GHC
- [GHC] #7397: -fwarn-irrefutable-patterns
GHC
- [GHC] #5435: GHCi linker should run constructors for linked libraries
GHC
- [GHC] #4012: Compilation results are not deterministic
GHC
- [GHC] #4012: Compilation results are not deterministic
GHC
- [GHC] #7375: Building ghc fails because it is looking for an old version of libgmp
GHC
- [GHC] #4012: Compilation results are not deterministic
GHC
- [GHC] #4012: Compilation results are not deterministic
GHC
- [GHC] #4012: Compilation results are not deterministic
GHC
- [GHC] #7375: Building ghc fails because it is looking for an old version of libgmp
GHC
- [GHC] #7398: RULES don't apply to a newtype constructor
GHC
- [GHC] #7399: Test Posix004 fails in test-suite
GHC
- [GHC] #4012: Compilation results are not deterministic
GHC
- [GHC] #4012: Compilation results are not deterministic
GHC
- [GHC] #7395: DefaultSignatures conflict with default implementations
GHC
- [GHC] #7375: Building ghc fails because it is looking for an old version of libgmp
GHC
- [GHC] #7400: Strange closure type 17 internal error
GHC
- [GHC] #3072: considerations for management of shared libs
GHC
- [GHC] #3072: considerations for management of shared libs
GHC
- [GHC] #7299: threadDelay broken in ghci, Mac OS X
GHC
- [GHC] #5544: threadDelay with large values crashes the IO manager on 64-bit OS X
GHC
- [GHC] #7375: Building ghc fails because it is looking for an old version of libgmp
GHC
- [GHC] #7401: Can't derive instance for Eq when datatype has no constructor, when it's trivial do do so.
GHC
- [GHC] #7375: Building ghc fails because it is looking for an old version of libgmp
GHC
- [GHC] #7395: DefaultSignatures conflict with default implementations
GHC
- [GHC] #7400: Strange closure type 17 internal error
GHC
- [GHC] #7401: Can't derive instance for Eq when datatype has no constructor, when it's trivial do do so.
GHC
- [GHC] #7401: Can't derive instance for Eq when datatype has no constructor, while it is trivial do do so. (was: Can't derive instance for Eq when datatype has no constructor, when it's trivial do do so.)
GHC
- [GHC] #7395: DefaultSignatures conflict with default implementations
GHC
- [GHC] #7394: SafeHaskell permits OPTIONS_GHC pragmas
GHC
- [GHC] #7402: Warn about possible missing -XScopedTypeVariables on errors.
GHC
- [GHC] #7403: Segmentation fault
GHC
- [GHC] #7353: Make system IO interruptible on Windows
GHC
- [GHC] #7395: DefaultSignatures conflict with default implementations
GHC
- [GHC] #7339: GHC fails to build from source on Alpha
GHC
- [GHC] #7339: GHC fails to build from source on Alpha
GHC
- [GHC] #7400: Strange closure type 17 internal error
GHC
- [GHC] #7192: Bug in -fregs-graph with -fnew-codegen
GHC
- [GHC] #7395: DefaultSignatures conflict with default implementations
GHC
- [GHC] #7346: Allow the use of `deriving` for GHC generics
GHC
- [GHC] #7192: Bug in -fregs-graph with -fnew-codegen
GHC
- [GHC] #7346: Allow the use of `deriving` for GHC generics
GHC
- [GHC] #7375: Building ghc fails because it is looking for an old version of libgmp
GHC
- [GHC] #7346: Allow the use of `deriving` for GHC generics
GHC
- [GHC] #4012: Compilation results are not deterministic
GHC
- [GHC] #7404: Inconsistent treatment of overlap between type and kind variables in type families
GHC
- [GHC] #7405: use of -no-hs-main causes TH compiles to fail
GHC
- [GHC] #7339: GHC fails to build from source on Alpha
GHC
- [GHC] #7406: -ddump-ds does not turn on -fforce-recomp
GHC
- [GHC] #7375: Building ghc fails because it is looking for an old version of libgmp
GHC
- [GHC] #7405: use of -no-hs-main causes TH compiles to fail
GHC
- [GHC] #7192: Bug in -fregs-graph with -fnew-codegen
GHC
- [GHC] #7192: Bug in -fregs-graph with -fnew-codegen
GHC
- [GHC] #7192: Bug in -fregs-graph with -fnew-codegen
GHC
- [GHC] #7406: -ddump-ds does not turn on -fforce-recomp
GHC
- [GHC] #7375: Building ghc fails because it is looking for an old version of libgmp
GHC
- [GHC] #7375: Building ghc fails because it is looking for an old version of libgmp
GHC
- [GHC] #7375: Building ghc fails because it is looking for an old version of libgmp
GHC
- [GHC] #7407: error: expected ';' before 'else'
GHC
- [GHC] #7408: Do not warn on unused newtype constructors when used with FFI
GHC
- [GHC] #7192: Bug in -fregs-graph with -fnew-codegen
GHC
- [GHC] #7409: Document special "this" module name for PackageImports extension
GHC
- [GHC] #7410: Type error says that tuple components have kind (* -> *)
GHC
- [GHC] #7192: Bug in -fregs-graph with -fnew-codegen
GHC
- [GHC] #7411: Exceptions are optimized away in certain situations
GHC
- [GHC] #7339: GHC fails to build from source on Alpha
GHC
- [GHC] #7400: Strange closure type 17 internal error
GHC
- [GHC] #7339: GHC fails to build from source on Alpha
GHC
- [GHC] #7395: DefaultSignatures conflict with default implementations
GHC
- [GHC] #7395: DefaultSignatures conflict with default implementations
GHC
- [GHC] #7412: Document how to import the special built-in functions such as inline
GHC
- [GHC] #7412: Document how to import the special built-in functions such as inline
GHC
- [GHC] #7406: -ddump-ds does not turn on -fforce-recomp
GHC
- [GHC] #7339: GHC fails to build from source on Alpha
GHC
- [GHC] #5734: Build failure on mips: ghc-cabal: Failed to read "target arch" value "ArchMipseb"
GHC
- [GHC] #7339: GHC fails to build from source on Alpha
GHC
- [GHC] #6026: Unboxed operators have wrong fixity
GHC
- [GHC] #7413: runghc (runhaskell) should be able to reload code on editing
GHC
- [GHC] #7413: runghc (runhaskell) should be able to reload code on editing
GHC
- [GHC] #7412: Document how to import the special built-in functions such as inline
GHC
- [GHC] #6026: Unboxed operators have wrong fixity
GHC
- [GHC] #5550: GHC infinite loop when compiling vector
GHC
- [GHC] #7414: plugins always trigger recompilation
GHC
- [GHC] #7270: Incorrect optimization with Data.ByteString.append
GHC
- [GHC] #7414: plugins always trigger recompilation
GHC
- [GHC] #7270: Incorrect optimization with Data.ByteString.append
GHC
- [GHC] #7415: Add more error code support to GHC.Windows (patch)
GHC
- [GHC] #7406: -ddump-ds does not turn on -fforce-recomp
GHC
- [GHC] #7339: GHC fails to build from source on Alpha
GHC
- [GHC] #7416: ghci "attempting to use module ... which is not loaded" after cabal install, in source dir
GHC
- [GHC] #7392: "the impossible happened" when compiling Types.Substitutions
GHC
- [GHC] #7406: -ddump-ds does not turn on -fforce-recomp
GHC
- [GHC] #7416: ghci "attempting to use module ... which is not loaded" after cabal install, in source dir
GHC
- [GHC] #5544: threadDelay with large values crashes the IO manager on 64-bit OS X
GHC
- [GHC] #7403: Segmentation fault
GHC
- [GHC] #7406: -ddump-ds does not turn on -fforce-recomp
GHC
- [GHC] #7406: -ddump-ds does not turn on -fforce-recomp
GHC
- [GHC] #7392: "the impossible happened" when compiling Types.Substitutions
GHC
- [GHC] #7417: Undeprecate Control.Concurrent.QSem
GHC
- [GHC] #7417: Undeprecate Control.Concurrent.QSem
GHC
- [GHC] #7417: Undeprecate Control.Concurrent.QSem
GHC
- [GHC] #7418: Writing to stderr is 7x slower than writing to stdout
GHC
- [GHC] #7418: Writing to stderr is 7x slower than writing to stdout
GHC
- [GHC] #7418: Writing to stderr is 7x slower than writing to stdout
GHC
- [GHC] #7417: Undeprecate Control.Concurrent.QSem
GHC
- [GHC] #7419: "hpc markup" should accept multiple .mix file search paths
GHC
- [GHC] #7419: "hpc markup" should accept multiple .mix file search paths
GHC
- [GHC] #7419: "hpc markup" should accept multiple .mix file search paths
GHC
- [GHC] #7418: Writing to stderr is 7x slower than writing to stdout
GHC
- [GHC] #7420: mis-attributed kind in the explict type/kind signature
GHC
- [GHC] #7299: threadDelay broken in ghci, Mac OS X
GHC
- [GHC] #7420: mis-attributed kind in the explict type/kind signature
GHC
- [GHC] #7420: mis-attributed kind in the explict type/kind signature
GHC
- [GHC] #7062: Spurious undefined reference to `openpty'
GHC
- [GHC] #7417: replace Control.Concurrent.QSem (was: Undeprecate Control.Concurrent.QSem)
GHC
- [GHC] #7270: Incorrect optimization with Data.ByteString.append
GHC
- [GHC] #7407: error: expected ';' before 'else'
GHC
- [GHC] #1409: Allow recursively dependent modules transparently (without .hs-boot or anything)
GHC
- [GHC] #4385: Type-level natural numbers
GHC
- [GHC] #7407: error: expected ';' before 'else'
GHC
- [GHC] #7407: error: expected ';' before 'else'
GHC
- [GHC] #1409: Allow recursively dependent modules transparently (without .hs-boot or anything)
GHC
- [GHC] #7158: GHCi commands case insensitive
GHC
- [GHC] #7347: Existential data constructors should not be promoted
GHC
- [GHC] #7379: rangeTest test fails on Windows
GHC
- [GHC] #7419: "hpc markup" should accept multiple .mix file search paths
GHC
- [GHC] #7419: "hpc markup" should accept multiple .mix file search paths
GHC
- [GHC] #7299: threadDelay broken in ghci, Mac OS X
GHC
- [GHC] #7421: Data.List.insert / insertBy do not match the documentation
GHC
- [GHC] #7415: Add more error code support to GHC.Windows (patch)
GHC
- [GHC] #7299: threadDelay broken in ghci, Mac OS X
GHC
- [GHC] #7299: threadDelay broken in ghci, Mac OS X
GHC
- [GHC] #7422: GHC panics while trying to derive Generic for GADT with kind-lifted phantom parameter
GHC
- [GHC] #7423: panic on typo in deriving clause
GHC
- [GHC] #7423: panic on typo in deriving clause
GHC
- [GHC] #7267: linux-ppc64: Segfault during stage2 build
GHC
- [GHC] #7342: Bug in System.Posix.Env.putEnv
GHC
- [GHC] #7226: bytestring changes in 7.6 branch
GHC
- [GHC] #7342: Memory violation bug in System.Posix.Env.putEnv (was: Bug in System.Posix.Env.putEnv)
GHC
- [GHC] #3103: Compiling base with cabal fails.
GHC
- [GHC] #3831: SpecConstr should exploit cases where there is exactly one call pattern
GHC
- [GHC] #3927: Incomplete/overlapped pattern warnings + GADTs = inadequate
GHC
- [GHC] #4012: Compilation results are not deterministic
GHC
- [GHC] #4321: Unexpected stack overflow prevented by superfluous type annotation
GHC
- [GHC] #5019: OS X: ld: warning: could not create compact unwind for _ffi_call_unix64
GHC
- [GHC] #5407: ghc-7.2.1 build failed on sparc solaris with non-GNU linker
GHC
- [GHC] #5442: ghc-pkg unregister --user/--global/--package-conf not normative
GHC
- [GHC] #5780: -faggressive-primops change caused a failure in perf/compiler/parsing001
GHC
- [GHC] #7424: Add Data.Bits instance for Bool
GHC
- [GHC] #7425: Add method to Data.Bits for creating zeroed values.
GHC
- [GHC] #6022: GHC infers over-general types
GHC
- [GHC] #5831: space_leak_001(ghci) segfaults on OS X x86_64
GHC
- [GHC] #6098: debugger does not know the correct type for a newtype field
GHC
- [GHC] #7056: GHCi loadArchive "libiconv.a":failed Unknown PEi386 section name `.drectve'
GHC
- [GHC] #7062: Spurious undefined reference to `openpty'
GHC
- [GHC] #7103: Compiler panic, when loading wxc in GHCi
GHC
- [GHC] #7103: Compiler panic, when loading wxc in GHCi
GHC
- [GHC] #7108: Link to haskell report in prelude
GHC
- [GHC] #7229: Detecting if a process was killed by a signal is impossible
GHC
- [GHC] #7043: 32-bit GHC ceiling of negative float SEGFAULT: 11
GHC
- [GHC] #7281: GHC 7.4.2 build fails on Fedora17
GHC
- [GHC] #7281: GHC 7.4.2 build fails on Fedora17
GHC
- [GHC] #7426: import Foo hiding (X) should not be a fatal error when X is not exported by Foo
GHC
- [GHC] #7426: import Foo hiding (X) should not be a fatal error when X is not exported by Foo
GHC
- [GHC] #7426: import Foo hiding (X) should not be a fatal error when X is not exported by Foo
GHC
- [GHC] #7281: GHC 7.4.2 build fails on Fedora17
GHC
- [GHC] #7281: GHC 7.4.2 build fails on Fedora17
GHC
- [GHC] #7108: Link to haskell report in prelude
GHC
- [GHC] #7421: Data.List.insert / insertBy do not match the documentation
GHC
- [GHC] #7267: linux-ppc64: Segfault during stage2 build
GHC
- [GHC] #7267: linux-ppc64: Segfault during stage2 build
GHC
- [GHC] #7427: Proposal: Add setEnv/unsetEnv to System.Environment
GHC
- [GHC] #7427: Proposal: Add setEnv/unsetEnv to System.Environment
GHC
- [GHC] #7427: Proposal: Add setEnv/unsetEnv to System.Environment
GHC
- [GHC] #5505: Program runs faster with profiling than without
GHC
- [GHC] #5505: Program runs faster with profiling than without
GHC
- [GHC] #7428: Occurrence analyzer out of memory
GHC
- [GHC] #7428: Occurrence analyzer out of memory
GHC
- [GHC] #7428: Occurrence analyzer out of memory
GHC
- [GHC] #7428: Occurrence analyzer out of memory
GHC
- [GHC] #7428: Occurrence analyzer out of memory
GHC
- [GHC] #7422: GHC panics while trying to derive Generic for GADT with kind-lifted phantom parameter
GHC
- [GHC] #7400: Strange closure type 17 internal error
GHC
- [GHC] #7360: Case-of-identical-alts optimisation fails abjectly
GHC
- [GHC] #7428: Occurrence analyzer out of memory
GHC
- [GHC] #7426: import Foo hiding (X) should not be a fatal error when X is not exported by Foo
GHC
- [GHC] #7429: Unexplained performance boost with +RTS -h
GHC
- [GHC] #5505: Program runs faster with profiling than without
GHC
- [GHC] #7353: Make system IO interruptible on Windows
GHC
- [GHC] #7267: linux-ppc64: Segfault during stage2 build
GHC
- [GHC] #7308: Better code for top-level indirections
GHC
- [GHC] #7308: Better code for top-level indirections
GHC
- [GHC] #7405: use of -no-hs-main causes TH compiles to fail
GHC
- [GHC] #7062: Spurious undefined reference to `openpty'
GHC
- [GHC] #7062: Spurious undefined reference to `openpty'
GHC
- [GHC] #5743: Configurably use system-provided libffi
GHC
- [GHC] #7430: GHC API reports CPP errors in confusing ways
GHC
- [GHC] #7430: GHC API reports CPP errors in confusing ways
GHC
- [GHC] #7356: Building HEAD on Mac OS X 10.5 reports Undefined "_pthread_threadid_np" ref'd from _kernelThreadId in libHSrts_thr.a(OSThreads.thr_o)
GHC
- [GHC] #7374: rule not firing
GHC
- [GHC] #3072: considerations for management of shared libs
GHC
- [GHC] #7378: Identical alts/bad divInt# code
GHC
- [GHC] #7388: CAPI doesn't work with ghci
GHC
- [GHC] #7390: Setup.hs: internal error: stg_ap_v_ret (MacOS)
GHC
- [GHC] #7395: DefaultSignatures conflict with default implementations
GHC
- [GHC] #7346: Allow the use of `deriving` for GHC generics
GHC
- [GHC] #7407: error: expected ';' before 'else'
GHC
- [GHC] #7431: execvpe exists on QNX
GHC
- [GHC] #7429: Unexplained performance boost with +RTS -h
GHC
- [GHC] #7429: Unexplained performance boost with +RTS -h
GHC
- [GHC] #7429: Unexplained performance boost with +RTS -h
GHC
- [GHC] #7267: linux-ppc64: Segfault during stage2 build
GHC
- [GHC] #7432: haddock : panic! (the 'impossible' happened)
GHC
- [GHC] #7433: Promoted types accepted without flag
GHC
- [GHC] #7433: Promoted constructors accepted without flag (was: Promoted types accepted without flag)
GHC
- [GHC] #6017: Reading ./.ghci files raises security issues
GHC
- [GHC] #6017: Reading ./.ghci files raises security issues
GHC
- [GHC] #6017: Reading ./.ghci files raises security issues
GHC
- [GHC] #6017: Reading ./.ghci files raises security issues
GHC
- [GHC] #7434: Add (&) to Data.Function
GHC
- [GHC] #7429: Unexplained performance boost with +RTS -h
GHC
- [GHC] #7429: Unexplained performance boost with +RTS -h
GHC
- [GHC] #7435: Add swap and compose to the Prelude, or Tuple/List
GHC
- [GHC] #7435: Add swap and compose to the Prelude, or Tuple/List
GHC
- [GHC] #7429: Unexplained performance boost with +RTS -h
GHC
- [GHC] #7435: Add swap and compose to the Prelude, or Tuple/List
GHC
- [GHC] #7267: linux-ppc64: Segfault during stage2 build
GHC
- [GHC] #7432: haddock : panic! (the 'impossible' happened)
GHC
- [GHC] #7434: Add (&) to Data.Function
GHC
- [GHC] #7419: "hpc markup" should accept multiple .mix file search paths
GHC
- [GHC] #6067: regression: cgrun051(ghci) failing in HEAD
GHC
- [GHC] #7429: Unexplained performance boost with +RTS -h
GHC
- [GHC] #7429: Unexplained performance boost with +RTS -h
GHC
- [GHC] #7419: "hpc markup" should accept multiple .mix file search paths
GHC
- [GHC] #7429: Unexplained performance boost with +RTS -h
GHC
- [GHC] #7361: Segmentation fault on 5f37e0c71ff4af8539c5aebc739b006b4f0c6ebf
GHC
- [GHC] #7267: linux-ppc64: Segfault during stage2 build
GHC
- [GHC] #7422: GHC panics while trying to derive Generic for GADT with kind-lifted phantom parameter
GHC
- [GHC] #7436: Derived Foldable and Traversable instances become extremely inefficient due to eta-expansion
GHC
- [GHC] #7432: haddock : panic! (the 'impossible' happened)
GHC
- [GHC] #7360: Case-of-identical-alts optimisation fails abjectly
GHC
- [GHC] #7436: Derived Foldable and Traversable instances become extremely inefficient due to eta-expansion
GHC
- [GHC] #7436: Derived Foldable and Traversable instances become extremely inefficient due to eta-expansion
GHC
- [GHC] #7436: Derived Foldable and Traversable instances become extremely inefficient due to eta-expansion
GHC
- [GHC] #7436: Derived Foldable and Traversable instances become extremely inefficient due to eta-expansion
GHC
- [GHC] #7405: use of -no-hs-main causes TH compiles to fail
GHC
- [GHC] #7436: Derived Foldable and Traversable instances become extremely inefficient due to eta-expansion
GHC
- [GHC] #7433: Promoted constructors accepted without flag
GHC
- [GHC] #7436: Derived Foldable and Traversable instances become extremely inefficient due to eta-expansion
GHC
- [GHC] #367: Infinite loops can hang Concurrent Haskell
GHC
- [GHC] #7433: Promoted constructors accepted without flag
GHC
- [GHC] #7361: Segmentation fault on 5f37e0c71ff4af8539c5aebc739b006b4f0c6ebf
GHC
- [GHC] #7267: linux-ppc64: Segfault during stage2 build
GHC
- [GHC] #7361: Segmentation fault on 5f37e0c71ff4af8539c5aebc739b006b4f0c6ebf
GHC
- [GHC] #7361: Segmentation fault on 5f37e0c71ff4af8539c5aebc739b006b4f0c6ebf
GHC
- [GHC] #7437: peculiar behaviour with default instances and type variables
GHC
- [GHC] #7227: cannot build ghc-7.6.1 because haddock seg-faults
GHC
- [GHC] #7437: peculiar behaviour with default instances and type variables
GHC
- [GHC] #7436: Derived Foldable and Traversable instances become extremely inefficient due to eta-expansion
GHC
- [GHC] #7438: Tc panic when type declaration is missing
GHC
- [GHC] #7438: Tc panic when type declaration is missing
GHC
- [GHC] #7438: Tc panic when type declaration is missing
GHC
- [GHC] #7436: Derived Foldable and Traversable instances become extremely inefficient due to eta-expansion
GHC
- [GHC] #7347: Existential data constructors should not be promoted
GHC
- [GHC] #6117: Cyclic Type Class Hierarchy Produces <<loop>>
GHC
- [GHC] #7439: Include dynamic-by-default support in Cabal with GHC 7.6.2
GHC
- [GHC] #7440: haddock : Declaration for $fEqInteger attempting to use module `ghc-prim:GHC.Classes' which is not loaded
GHC
- [GHC] #7441: kindFunResult Error
GHC
- [GHC] #7442: [PATCH] Fix broken -fPIC on Darwin/PPC
GHC
- [GHC] #7442: [PATCH] Fix broken -fPIC on Darwin/PPC
GHC
- [GHC] #7443: Generated C code under -prof -fprof-auto -fprof-cafs very slow to compile
GHC
- [GHC] #7361: Segmentation fault on 5f37e0c71ff4af8539c5aebc739b006b4f0c6ebf
GHC
- [GHC] #7441: kindFunResult Error
GHC
- [GHC] #7441: kindFunResult Error
GHC
- [GHC] #7436: Derived Foldable and Traversable instances become extremely inefficient due to eta-expansion
GHC
- [GHC] #7442: [PATCH] Fix broken -fPIC on Darwin/PPC
GHC
- [GHC] #7441: kindFunResult Error
GHC
- [GHC] #7413: runghc (runhaskell) should be able to reload code on editing
GHC
- [GHC] #7361: Segmentation fault on 5f37e0c71ff4af8539c5aebc739b006b4f0c6ebf
GHC
- [GHC] #7413: runghc (runhaskell) should be able to reload code on editing
GHC
- [GHC] #5489: Win7: Bootstrapping 7.3 from 7.2.1 using msys git 1.7.6 causes integer-gmp ./configure to fail
GHC
- [GHC] #1409: Allow recursively dependent modules transparently (without .hs-boot or anything)
GHC
- [GHC] #7438: Tc panic when type declaration is missing
GHC
- [GHC] #7438: Tc panic when type declaration is missing
GHC
- [GHC] #7444: Derive Generic1 representation
GHC
- [GHC] #7444: Derive Generic1 representation
GHC
- [GHC] #7444: Update documentation regarding derivability of Generic1 (was: Derive Generic1 representation)
GHC
- [GHC] #7444: Update documentation regarding derivability of Generic1
GHC
- [GHC] #7444: Update documentation regarding derivability of Generic1
GHC
- [GHC] #6117: Cyclic Type Class Hierarchy Produces <<loop>>
GHC
- [GHC] #6026: Unboxed operators have wrong fixity
GHC
- [GHC] #5407: ghc-7.2.1 build failed on sparc solaris with non-GNU linker
GHC
- [GHC] #6026: Unboxed operators have wrong fixity
GHC
- [GHC] #5407: ghc-7.2.1 build failed on sparc solaris with non-GNU linker
GHC
- [GHC] #7419: "hpc markup" should accept multiple .mix file search paths
GHC
- [GHC] #7434: Add (&) to Data.Function
GHC
- [GHC] #7435: Add swap and compose to the Prelude, or Tuple/List
GHC
- [GHC] #7415: Add more error code support to GHC.Windows (patch)
GHC
- [GHC] #7445: template-haskell : the impossible happened
GHC
- [GHC] #7445: template-haskell : the impossible happened
GHC
- [GHC] #7445: template-haskell : the impossible happened
GHC
- [GHC] #7442: [PATCH] Fix broken -fPIC on Darwin/PPC
GHC
- [GHC] #7446: GHC -O0 goes into a loop
GHC
- [GHC] #7446: GHC -O0 goes into a loop
GHC
- [GHC] #7447: Stale .hi files affect compilation.
GHC
- [GHC] #7446: GHC -O0 goes into a loop
GHC
- [GHC] #7448: Detabbing
GHC
- [GHC] #7449: Segmentation fault in floor function
GHC
- [GHC] #7043: 32-bit GHC ceiling of negative float SEGFAULT: 11
GHC
- [GHC] #7449: Segmentation fault in floor function
GHC
- [GHC] #4244: Use system linker in GHCi to support alpha, ia64, ppc64
GHC
- [GHC] #781: GHCi on x86_64, cannot link to static data in shared libs
GHC
- [GHC] #7347: Existential data constructors should not be promoted
GHC
- [GHC] #7440: haddock : Declaration for $fEqInteger attempting to use module `ghc-prim:GHC.Classes' which is not loaded
GHC
- [GHC] #7439: Include dynamic-by-default support in Cabal with GHC 7.6.2
GHC
- [GHC] #7428: Occurrence analyzer out of memory
GHC
- [GHC] #7450: Regression in optimisation time of functions with many patterns (6.12 to 7.4)?
GHC
- [GHC] #7451: Constraint and * should not be distinct in FC
GHC
- [GHC] #6117: Cyclic Type Class Hierarchy Produces <<loop>>
GHC
- [GHC] #7404: Inconsistent treatment of overlap between type and kind variables in type families
GHC
- [GHC] #7410: Type error says that tuple components have kind (* -> *)
GHC
- [GHC] #7451: Constraint and * should not be distinct in FC
GHC
- [GHC] #7048: Add the ability to statically define a `FunPtr` to a haskell function
GHC
- [GHC] #7410: Type error says that tuple components have kind (* -> *)
GHC
- [GHC] #7408: Do not warn on unused newtype constructors when used with FFI
GHC
- [GHC] #7451: Constraint and * should not be distinct in FC
GHC
- [GHC] #7450: Regression in optimisation time of functions with many patterns (6.12 to 7.4)?
GHC
- [GHC] #7258: Compiling DynFlags is jolly slow
GHC
- [GHC] #7258: Compiling DynFlags is jolly slow
GHC
- [GHC] #7134: ghc-7.6.0.20120810-x86_64-windows.exe -> internal error R_X86_64_PC32
GHC
- [GHC] #7452: [GNU gold] ld: error: cannot find [...]/Types__1.o
GHC
- [GHC] #7299: threadDelay broken in ghci, Mac OS X
GHC
- [GHC] #7452: [GNU gold] ld: error: cannot find [...]/Types__1.o
GHC
- [GHC] #7408: Do not warn on unused newtype constructors when used with FFI
GHC
- [GHC] #7404: Inconsistent treatment of overlap between type and kind variables in type families
GHC
- [GHC] #7408: Do not warn on unused newtype constructors when used with FFI
GHC
- [GHC] #7408: Do not warn on unused newtype constructors when used with FFI
GHC
- [GHC] #7429: Unexplained performance boost with +RTS -h
GHC
- [GHC] #7429: Unexplained performance boost with +RTS -h
GHC
- [GHC] #7450: Regression in optimisation time of functions with many patterns (6.12 to 7.4)?
GHC
- [GHC] #7450: Regression in optimisation time of functions with many patterns (6.12 to 7.4)?
GHC
- [GHC] #7450: Regression in optimisation time of functions with many patterns (6.12 to 7.4)?
GHC
- [GHC] #7428: GHC compile times are seriously non-linear in program size (was: Occurrence analyzer out of memory)
GHC
- [GHC] #2588: Missed suggestion with context on foralls
GHC
- [GHC] #7258: Compiling DynFlags is jolly slow
GHC
- [GHC] #7453: unsafe coerce without extensions
GHC
- [GHC] #7453: unsafe coerce without extensions
GHC
- [GHC] #7231: GHCi erroneously unloads modules after a failed :reload
GHC
- [GHC] #7231: GHCi erroneously unloads modules after a failed :reload
GHC
- [GHC] #7231: GHCi erroneously unloads modules after a failed :reload
GHC
- [GHC] #7453: unsafe coerce without extensions
GHC
- [GHC] #7453: unsafe coerce without extensions
GHC
- [GHC] #7453: unsafe coerce without extensions
GHC
- [GHC] #7453: unsafe coerce without extensions
GHC
- [GHC] #7453: unsafe coerce without extensions
GHC
- [GHC] #7453: unsafe coerce without extensions
GHC
- [GHC] #7454: Missing warning about redundant import of classes/types whose members are used
GHC
- [GHC] #5987: Too many symbols in ghc package DLL
GHC
- [GHC] #7453: unsafe coerce without extensions
GHC
- [GHC] #7453: unsafe coerce without extensions
GHC
- [GHC] #7453: unsafe coerce without extensions
GHC
- [GHC] #5987: Too many symbols in ghc package DLL
GHC
- [GHC] #7453: unsafe coerce without extensions
GHC
- [GHC] #7361: Segmentation fault on 5f37e0c71ff4af8539c5aebc739b006b4f0c6ebf
GHC
- [GHC] #7368: kindFunResult panic in the
GHC
- [GHC] #7368: kindFunResult panic in the
GHC
- [GHC] #7455: ghc panic on show
GHC
- [GHC] #7455: ghc panic on show
GHC
- [GHC] #7453: unsafe coerce without extensions
GHC
- [GHC] #7456: GHC API displays linker messages to stdout instead of via log_action
GHC
- [GHC] #7457: printf's * doesn't like negative numbers
GHC
- [GHC] #7458: ghc panic
GHC
- [GHC] #7458: ghc panic
GHC
- [GHC] #7447: Stale .hi files affect compilation.
GHC
- [GHC] #7457: printf's * doesn't like negative numbers
GHC
- [GHC] #7458: ghc panic
GHC
- [GHC] #7458: ghc panic
GHC
- [GHC] #7351: showRichTokenStream has an off-by one error on starting col
GHC
- [GHC] #7384: Panic "ctEvTerm" when using functional dependencies and PolyKinds
GHC
- [GHC] #7231: GHCi erroneously unloads modules after a failed :reload
GHC
- [GHC] #7303: RTS : Race condition with usage of timer_delete
GHC
- [GHC] #5407: ghc-7.2.1 build failed on sparc solaris with non-GNU linker
GHC
- [GHC] #7318: CONLIKE pragma documentation bug
GHC
- [GHC] #7321: Compiler hangs when reading interface file
GHC
- [GHC] #7338: Duplicate type signature not reported
GHC
- [GHC] #7386: Panic "tcTyVarDetails" in GHCi when :forcing a data family instance
GHC
- [GHC] #7270: Incorrect optimization with Data.ByteString.append
GHC
- [GHC] #7226: bytestring changes in 7.6 branch
GHC
- [GHC] #7459: deriving Generic does not work with TypeLits
GHC
- [GHC] #7348: base-4.6 does not export `catch` from Prelude while Control.Exception documentation still claims so
GHC
- [GHC] #7349: -fth is deprecated without warning
GHC
- [GHC] #7444: Update documentation regarding derivability of Generic1
GHC
- [GHC] #7438: Tc panic when type declaration is missing
GHC
- [GHC] #7356: Building HEAD on Mac OS X 10.5 reports Undefined "_pthread_threadid_np" ref'd from _kernelThreadId in libHSrts_thr.a(OSThreads.thr_o)
GHC
- [GHC] #7276: -fdefer-type-errors allows the types of quotations to be coerced, causing segmentation fault
GHC
- [GHC] #7312: panic! applytTypeToArgs with non-infix function type constructor
GHC
- [GHC] #7446: GHC -O0 goes into a loop
GHC
- [GHC] #7294: -fdefer-type-errors doesn't produce a warning
GHC
- [GHC] #7328: Seemingly inappropriate "expecting one more argument" error in polykinded class
GHC
- [GHC] #7341: Kind inference does not propagate annotations on associated types
GHC
- [GHC] #7446: GHC -O0 goes into a loop
GHC
- [GHC] #7310: Compiler nontermination on UNPACK pragmas
GHC
- [GHC] #7433: Promoted constructors accepted without flag
GHC
- [GHC] #7272: PolyKinds and mutually recursive modules
GHC
- [GHC] #7347: Existential data constructors should not be promoted
GHC
- [GHC] #7451: Constraint and * should not be distinct in FC
GHC
- [GHC] #7410: Type error says that tuple components have kind (* -> *)
GHC
- [GHC] #7287: Primops in RULES generate warnings
GHC
- [GHC] #7332: Kind-defaulting omitted leads to deeply obscure type error
GHC
- [GHC] #7332: Kind-defaulting omitted leads to deeply obscure type error
GHC
- [GHC] #2132: Optimise nested comparisons
GHC
- [GHC] #7382: Evaluating GHCi expressions is slow following the dynamic-by-default change
GHC
- [GHC] #6017: Reading ./.ghci files raises security issues
GHC
- [GHC] #7460: Double literals generated bad core
GHC
- [GHC] #4496: add a configure build option to use system libffi for Linux
GHC
- [GHC] #5743: Configurably use system-provided libffi
GHC
- [GHC] #7460: Double literals generated bad core
GHC
- [GHC] #7460: Double literals generated bad core
GHC
- [GHC] #7460: Double literals generated bad core
GHC
- [GHC] #7460: Double literals generated bad core
GHC
- [GHC] #7461: Error messages about "do" statements contain false information
GHC
- [GHC] #5743: Configurably use system-provided libffi
GHC
- [GHC] #4496: add a configure build option to use system libffi for Linux
GHC
- [GHC] #5743: Configurably use system-provided libffi
GHC
- [GHC] #7462: New nofib benchmark for unpacked arrays and floating point arithmetic
GHC
- [GHC] #7462: New nofib benchmark for unpacked arrays and floating point arithmetic
GHC
- [GHC] #7463: [PATCH] When -keep-hc-files is enabled, foreign stubs *_stub.c should also be kept.
GHC
- [GHC] #7463: [PATCH] When -keep-hc-files is enabled, foreign stubs *_stub.c should also be kept.
GHC
- [GHC] #2132: Optimise nested comparisons
GHC
- [GHC] #5743: Configurably use system-provided libffi
GHC
- [GHC] #7464: git tag for base-4.6.0.0 missing
GHC
- [GHC] #7459: deriving Generic does not work with TypeLits
GHC
- [GHC] #5928: INLINABLE fails to specialize in presence of simple wrapper
GHC
- [GHC] #3080: Show more instances with :info
GHC
- [GHC] #7256: Missing dataCast1 and dataCast2 methods in Data.Data instances
GHC
- [GHC] #7256: Missing dataCast1 and dataCast2 methods in Data.Data instances
GHC
- [GHC] #5743: Configurably use system-provided libffi
GHC
- [GHC] #5743: Configurably use system-provided libffi
GHC
- [GHC] #5743: Configurably use system-provided libffi
GHC
- [GHC] #6017: Reading ./.ghci files raises security issues
GHC
- [GHC] #5743: Configurably use system-provided libffi
GHC
- [GHC] #5743: Configurably use system-provided libffi
GHC
- [GHC] #7162: RULES that never fire (automatically)
GHC
- [GHC] #7256: Missing dataCast1 and dataCast2 methods in Data.Data instances
GHC
- [GHC] #7228: ghc-pkg prints an awful lot of usage information
GHC
- [GHC] #5743: Configurably use system-provided libffi
GHC
- [GHC] #7162: RULES that never fire (automatically)
GHC
- [GHC] #7333: python2
GHC
- [GHC] #7162: RULES that never fire (automatically)
GHC
- [GHC] #2431: allow empty case analysis
GHC
- [GHC] #7134: ghc-7.6.0.20120810-x86_64-windows.exe -> internal error R_X86_64_PC32
GHC
- [GHC] #7465: ./configure --with--ffi-libraries: ld cannot find libffi in a non-standard location
GHC
- [GHC] #7134: ghc-7.6.0.20120810-x86_64-windows.exe -> internal error R_X86_64_PC32
GHC
- [GHC] #7134: ghc-7.6.0.20120810-x86_64-windows.exe -> internal error R_X86_64_PC32
GHC
Last message date:
Fri Nov 30 21:47:36 CET 2012
Archived on: Fri Nov 30 21:47:47 CET 2012
This archive was generated by
Pipermail 0.09 (Mailman edition).