client builder issue.

Karel Gardas karel.gardas at
Fri Dec 17 14:35:17 CET 2010


I've attempted to update my builder client to the today's source code 
and compiled it by GHC 7.0.1 (I've hacked cabal files' versions in order 
to do so). When running against GHC builder server with --do-build 
option I've got following failure:

Running "testing"
builder-client-v2: fd:11: hGetLine: invalid argument (Illegal byte sequence)
[2010-12-17 12:14:05] [kgardas-opensolaris-x86-head] Sending: "UPLOAD 79 1"
builder-client-v2: SSLIOError

I guess due to it, my testing fails with:

=====> print021(ghci) 286 of 2675 [0, 1, 0]
cd ./ghci.debugger/scripts && 
dir/bin/ghc' HC_OPTS='-dcore-lint -dcmm-lint -dno-debug-output 
-no-user-package-conf -rtsopts ' 
dir/bin/ghc' --interactive -v0 -ignore-dot-ghci -dcore-lint -dcmm-lint 
-dno-debug-output -no-user-package-conf -rtsopts -ignore-dot-ghci 
<print021.script > 2>
Actual stdout output differs from expected:
--- ./ghci.debugger/scripts/print021.stdout.normalised Fri Dec 17 
14:14:05 2010
+++ ./ghci.debugger/scripts/ Fri Dec 17 
14:14:05 2010
@@ -1,2 +1,2 @@
test = (_t1::[T])
Traceback (most recent call last):
File "../../driver/", line 238, in ?
line 479, in <lambda>
allTests += [lambda : runTest(myTestOpts, name, setup, func, args)]
line 469, in runTest
test_common_work (name, opts, func, args)
line 545, in test_common_work
do_test (name, way, func, args)
line 666, in do_test
framework_fail(name, way, 'do_test exception')
line 679, in framework_fail
print '*** framework failure for', full_name, reason, ':'
IOError: [Errno 32] Broken pipe
gmake[2]: *** [test] Error 1
gmake[1]: *** [fast] Broken Pipe
gmake: *** [test] Broken Pipe

Or is it vice versa? See

is this a known issue or shall I do something about it?


More information about the Glasgow-haskell-users mailing list