[GHC] #4250: make install fails with the head version of GHC

GHC cvs-ghc at haskell.org
Mon Aug 16 05:11:55 EDT 2010


#4250: make install fails with the head version of GHC
-------------------------------+--------------------------------------------
    Reporter:  maa             |        Owner:                       
        Type:  bug             |       Status:  new                  
    Priority:  normal          |    Milestone:                       
   Component:  Build System    |      Version:  6.13                 
    Keywords:                  |     Testcase:                       
   Blockedby:                  |   Difficulty:                       
          Os:  Linux           |     Blocking:                       
Architecture:  x86_64 (amd64)  |      Failure:  Installing GHC failed
-------------------------------+--------------------------------------------
Description changed by simonpj:

Old description:

> I get the latest sources using the following commands and build them.
> ./darcs-all pull -av
> perl boot
> ./configure --prefix=/tmp/ghc-6.13.0
> make
>
> However while doing 'make install', i get the following error message.
>
> ...
> for i in utils/haddock/html/*; do \
>             /usr/bin/install -c -m 644  $i
> "/tmp/ghc-6.13.0/lib/ghc-6.13.20100810/html"; \
>         done
> /usr/bin/install: omitting directory `utils/haddock/html/Classic.theme'
> /usr/bin/install: omitting directory `utils/haddock/html/Ocean.std-theme'
> /usr/bin/install: omitting directory `utils/haddock/html/Snappy.theme'
> make[1]: *** [install_utils/haddock_data] Error 1
> make: *** [install] Error 2

New description:

 I get the latest sources using the following commands and build them.
 {{{
 ./darcs-all pull -av
 perl boot
 ./configure --prefix=/tmp/ghc-6.13.0
 make
 }}}
 However while doing 'make install', i get the following error message.
 {{{
 ...
 for i in utils/haddock/html/*; do \
             /usr/bin/install -c -m 644  $i
 "/tmp/ghc-6.13.0/lib/ghc-6.13.20100810/html"; \
         done
 /usr/bin/install: omitting directory `utils/haddock/html/Classic.theme'
 /usr/bin/install: omitting directory `utils/haddock/html/Ocean.std-theme'
 /usr/bin/install: omitting directory `utils/haddock/html/Snappy.theme'
 make[1]: *** [install_utils/haddock_data] Error 1
 make: *** [install] Error 2
 }}}

--

-- 
Ticket URL: <http://hackage.haskell.org/trac/ghc/ticket/4250#comment:4>
GHC <http://www.haskell.org/ghc/>
The Glasgow Haskell Compiler


More information about the Glasgow-haskell-bugs mailing list