[Haskell-cafe] Failure in GHC compilation

Monique Monteiro monique.louise at gmail.com
Sat Jun 2 15:12:44 EDT 2007


  has anyone any idea about what may cause the following error in GHC

c:\ghc\ghc-6.6.1\bin\ar.exe: creating libHSbase.a
xargs: c:/ghc/ghc-6.6.1/bin/ar: Argument list too long
make[2]: *** [libHSbase.a] Error 126
make[2]: *** Deleting file `libHSbase.a'
Failed making all in base: 1
make[1]: *** [all] Error 1
make[1]: Leaving directory `/cygdrive/c/GHC6.6.1/ghc-6.6.1/libraries'
make: *** [stage1] Error 2

Thanks in advance,
Monique Monteiro, MSc
MCP .NET Framework 2.0 / SCJP / IBM OOAD
Project Manager
Recife Microsoft Innovation Center
+55 81 34198137
monique at qualiti.com.br
MSN: monique_louise at msn.com

More information about the Haskell-Cafe mailing list