cvs-head compile question

jur jur at
Fri Apr 28 05:56:25 EDT 2006

Hi there,

when I compile the head I get this message

/usr/bin/ld: Undefined symbols:
collect2: ld returned 1 exit status
<<ghc: 32089144 bytes, 4 GCs, 95456/95456 avg/max bytes residency (1  
samples), 16M in use, 0.03 INIT (0.00 elapsed), 0.51 MUT (33.23  
elapsed), 0.07 GC (0.26 elapsed) :ghc>>
make[2]: *** [stage2/ghc-6.5] Error 1
make[1]: *** [stage2] Error 2
make: *** [bootstrap2] Error 2

So what am I missing. Is it GTK+2? Do I really need it? Is there some  
way to compile
the compiler without needing to bother with this?


More information about the Glasgow-haskell-users mailing list