[GHC] #2342: timer problem under Sparc Solaris for Release Candidate ghc-6.8.2.20080603

GHC trac at galois.com
Fri Jun 6 04:42:06 EDT 2008


#2342: timer problem under Sparc Solaris for Release Candidate ghc-6.8.2.20080603
--------------------------+-------------------------------------------------
 Reporter:  maeder        |          Owner:         
     Type:  bug           |         Status:  new    
 Priority:  high          |      Milestone:  6.8.3  
Component:  Build System  |        Version:  6.8.2  
 Severity:  normal        |     Resolution:         
 Keywords:                |     Difficulty:  Unknown
 Testcase:                |   Architecture:  sparc  
       Os:  Solaris       |  
--------------------------+-------------------------------------------------
Comment (by maeder):

 A similar problem occurs now for libraries/old-time

 {{{
 ../../compiler/stage1/ghc-inplace -package-name old-time-1.0.0.0 -hide-
 all-packages -split-objs -i -idist/build/autogen -idist/build -i.
 -Idist/build -Iinclude -#include "HsTime.h" -odir dist/build -hidir
 dist/build -stubdir dist/build -package base-3.0.2.0 -package old-
 locale-1.0.0.0 -O -XCPP -XForeignFunctionInterface -idist/build  -H16m -O
 -optc-mcpu=ultrasparc -opta-mcpu=ultrasparc -O -Rghc-timing -fgenerics -c
 dist/build/System/Time.hs -o dist/build/System/Time.o  -ohi
 dist/build/System/Time.hi
 /tmp/ghc4604_0/ghc4604_0.hc: In function
 'oldzmtimezm1zi0zi0zi0_SystemziTime_zdLr69ZZzdwa1_entry':

 /tmp/ghc4604_0/ghc4604_0.hc:3200:0:
      error: 'altzone' undeclared (first use in this function)

 /tmp/ghc4604_0/ghc4604_0.hc:3200:0:
      error: (Each undeclared identifier is reported only once

 /tmp/ghc4604_0/ghc4604_0.hc:3200:0:
      error: for each function it appears in.)
 <<ghc: 549314440 bytes, 305 GCs, 8472576/12242944 avg/max bytes residency
 (8 samples), 34M in use, 0.00 INIT (0.00 elapsed), 7.22 MUT (10.66
 elapsed), 3.62 GC (3.75 elapsed) :ghc>>
 gmake[2]: *** [dist/build/System/Time.o] Error 1
 gmake[2]: Leaving directory
 `/export/local/home/maeder/ghc-6.8.2.20080603/libraries/old-time'
 gmake[1]: *** [make.library.old-time] Error 2
 gmake[1]: Leaving directory
 `/export/local/home/maeder/ghc-6.8.2.20080603/libraries'
 gmake: *** [stage1] Error 2
 }}}

-- 
Ticket URL: <http://hackage.haskell.org/trac/ghc/ticket/2342#comment:8>
GHC <http://www.haskell.org/ghc/>
The Glasgow Haskell Compiler


More information about the Glasgow-haskell-bugs mailing list