ghc 6.4.1 failed to build on IRIX64 6.5.29
Simon Marlow
simonmarhaskell at gmail.com
Mon Jun 26 07:04:57 EDT 2006
Andrew Jones wrote:
> /tmp/ghc363448.lpp:0: internal compiler error: Abort
> Please submit a full bug report,
> with preprocessed source if appropriate.
> See <URL:http://gcc.gnu.org/bugs.html> for instructions.
> <<ghc: 165577416 bytes, 35 GCs, 565100/969672 avg/max bytes residency (2
> samples), 17M in use, 0.02 INIT (0.00 elapsed), 6.26 MUT (19.68
> elapsed), 0.29 GC (0.41 elapsed) :ghc>>
> gmake[2]: *** [depend] Error 1
> gmake[1]: *** [boot] Error 1
> gmake[1]: Leaving directory `/disk2/src/ghc-6.4.1/ghc'
> gmake: *** [build] Error 1
> root at godot#
This one appears to be a crash in gcc, not much we can do about that I'm
afraid. Try a different version of gcc.
Cheers,
Simon
More information about the Glasgow-haskell-bugs
mailing list