GHC 6.2.2 and 6.4.1 on IRIX64 both failed, this time with new error
Andrew Jones
aijones2 at bsu.edu
Sun Jun 11 15:35:22 EDT 2006
This is the failed 6.4.1 build, but when using 3.4.6 instead of 3.4.0,
both 6.2.2 and 6.4.1 fail this way.
root at godot#gcc --version
gcc (GCC) 3.4.6
root at godot#uname -aR
IRIX64 godot 6.5 6.5.29f 01090133 IP27
root at godot#ghc --version
The Glorious Glasgow Haskell Compilation System, version 6.2
==fptools== gmake all -wr;
in /disk2/src/ghc-6.4.1/ghc/rts
------------------------------------------------------------------------
../../ghc/compiler/ghc-inplace "-L/usr/freeware/lib64" -O2 -static -I.
-#include Prelude.h -#include Rts.h -#include RtsFlags.h -#include
RtsUtils.h -#include StgRun.h -#include Schedule.h -#include Printer.h
-#include Sanity.h -#include STM.h -#include Storage.h -#include
SchedAPI.h -#include Timer.h -#include Itimer.h -#include ProfHeap.h
-#include LdvProfile.h -#include Profiling.h -#include Apply.h -fvia-C
-dcmm-lint -c Apply.cmm -o Apply.o
Cmm lint error:
in proc stg_ap_0_ret
in basic block c2
in assignment:
R1 = I32[R1 + 8 + 0];
Compilation had errors
gmake[2]: *** [Apply.o] Error 1
gmake[1]: *** [all] Error 1
gmake[1]: Leaving directory `/disk2/src/ghc-6.4.1/ghc'
gmake: *** [build] Error 1
More information about the Glasgow-haskell-bugs
mailing list