make install (at git ef01794) still fails

Tuncer Ayaz tuncer.ayaz at
Tue Aug 27 22:36:58 CEST 2013

I think the last time 'make install' worked for me was sometime in
February or March 2013. The build succeeds but 'make install' fails.

Is this normal?

git rev ef01794
linux i386
glibc 2.18
gcc 4.8.1

BuildFlavour = perf
V = 0

$ perl boot
$ ./configure --prefix=/tmp/ghc/7.7.20130827
$ make
$ make install
Installing library in
"/tmp/ghc/7.7.20130827/lib/ghc-7.7.20130827/bin/ghc-pkg" --force
"/tmp/ghc/7.7.20130827/lib/ghc-7.7.20130827/package.conf.d" update
/tmp/ghc/7.7.20130827/lib/ghc-7.7.20130827/bin/ghc-pkg: error while
loading shared libraries: cannot open shared
object file: No such file or directory

make[1]: *** [install_packages] Error 127
make: *** [install] Error 2


More information about the ghc-devs mailing list